{"text_format":"1","workbook":"xlsx","n_sheets":6,"sheets":["Introduction","Activate Buttons","Control and Results","DCF","Placement Factors","Default Values"],"not_rendered":{"charts":3,"images":8,"macros":1,"external_links":0,"defined_names":79,"comments":1,"pivot_tables":0},"unopened":[],"bounds":{"document_bytes":16777216,"sheet_cells":100000,"rows_first":2000,"rows_last":500,"rows_between":2000,"halvings":0,"cell_chars":16384,"cell_head_chars":4096},"cells_cut":0,"cells_raw":0,"read":"whole","date_system":"1900"}

{"sheet":"Introduction","index":0,"n_rows":45,"n_cols":14,"rows_kept":45,"cut":false,"hidden":false,"merged":[[5,2,14,17],[43,2,43,5],[37,2,41,17],[1,2,1,4],[44,13,44,16]]}
[]
[null,null,null,null,null,null,"Introduction"]
[]
[null,null,"Background"]
[]
[null,null,"This discounted cash flow (DCF) model was developed in the course of task 5.1 of the AURES project. With it, we intend to simulate the necessary support levels for single renewable energy investment projects under particular market conditions and assuming country and technology specific project characteristics as well as different auction designs. The main output is a non-strategic bid price, indicating that it is mainly based on economic calculations and does not include profound game theoretic modelling. The cash flow model aims at developing an understanding for economically feasible support levels. It has been published on the AURES webpage. The model consists of four worksheets. Worksheet \"Control and Results\" is the interface with the user, where all inputs are defined, the calculations are initiated and the results are displayed. The sheet \"DCF\" contains the DCF calculations. In the sheet \"Placement Factors\" the numerical factors for the final placement of the necessary support level are defined. The worksheet \"Default Values\" contains pre-defined values which allow an automatic fill-in of assumptions for a chosen configuration of technology and location for obtaining fast results. In this current version of the model, the default values are preliminary estimates and there is no guarantee for their reliability. The data base for the default values will be updated for subsequent versions which will be published on the AURES webpage. For further explanaitions of the used methods and calculations as well as more detailed information on how to use the model, please see the seperate document \"User Guide for DCF Model in AURES WP5\"."]
[]
[]
[]
[]
{"$rows_left_out":36}
{"sheet":"Activate Buttons","index":1,"n_rows":51,"n_cols":7,"rows_kept":51,"cut":false,"hidden":false,"merged":[[1,2,1,4],[5,2,14,17],[20,2,21,17]]}
[]
[null,null,null,null,null,null,"Activate the Buttons"]
[]
[null,null,"Change the macro security settings"]
[]
[null,null,"The calculations are initiated with the buttons in the \"Control and Results\" sheet. You have to make sure that macros in this worksheet are enabled in order to be able to use the buttons. Depending on your individual computer settings, one of the following cases should apply when you open the model file:                                                                                  A yellow message bar appears on the top, giving you a security warning. Here, you have to click on \"Enable Content\"."]
[]
[]
[]
[]
{"$rows_left_out":42}
{"sheet":"Control and Results","index":2,"n_rows":106,"n_cols":26,"rows_kept":106,"cut":false,"hidden":false,"merged":[[78,3,78,5],[79,3,79,5],[80,3,80,5],[68,7,68,8],[70,7,70,8],[59,3,59,6],[65,2,65,5],[65,7,65,11],[76,3,76,5],[75,3,75,5],[61,3,61,6]]}
[]
[null,null,null,null,null,"Inputs",null,null,null,null,null,null,null,null,null,"ancillary variables"]
[]
[]
[null,null,"Project Characteristics",null,null,null,null,null,null,null,null,null,null,null,null,null,"Wind onshore"]
[null,null,null,null,"Unit",null,null,"Assumptions","Start","Low","Medium","High","Unit",null,null,null,"Wind offshore"]
[null,null,"Technology",null,null,null,null,"Capacity Factor",null,null,null,null,"[%]",null,null,null,"Solar PV"]
[null,null,null,null,null,null,null,"Achieved Price",null,null,null,null,"[€/MWh]",null,null,"for rage suggestion",null,null,"for threshold analysis"]
[null,null,"Location",null,null,null,null,"CAPEX",null,null,null,null,"[€/kW]",null,null,"max. Cf",{"$f":"IF(D7=\"Solar PV\",'Default Values'!R69,IF(D7=\"Wind offshore\",'Default Values'!U72,'Default Values'!U70))","v":0.35},null,"initial CAPEX",995]
[null,null,null,null,null,null,null,"OPEX",null,null,null,null,"[€/kW*a]",null,null,"min. Cf",{"$f":"IF(D7=\"Solar PV\",'Default Values'!P69,IF(D7=\"Wind offshore\",'Default Values'!S72,'Default Values'!S70))","v":0.2},null,"initial WACC",0.1]
{"$rows_left_out":97}
{"sheet":"DCF","index":3,"n_rows":76,"n_cols":39,"rows_kept":76,"cut":false,"hidden":false,"merged":[]}
[null,null,"Active Capacity Factor","Medium",null,"Active CAPEX","Medium",null,"support level",{"$f":"'Control and Results'!G76","v":""},"[ct/kWh]"]
[null,null,"Active Achieved Price","Medium",null,"Active OPEX","Medium"]
[null,null,"Power Production Calculation"]
[null,null,"Project Year",0,1,2,3,4,5,6,7,8,9,10,11,12,13,14,15,16,17,18,19,20,21,22,23,24,25,26,27,28,29,30,31,32,33,34,35]
[]
[null,null,"PRODUCTION [kWh/kW]",{"$f":"IF(D4<'Control and Results'!$D$13+1,0,INDEX('Control and Results'!$J$7:$L$7,1,MATCH(DCF!$D$1,'Control and Results'!$J$6:$L$6,0))*8760)","v":0},{"$f":"IF(E4<'Control and Results'!$D$13+1,0,INDEX('Control and Results'!$J$7:$L$7,1,MATCH(DCF!$D$1,'Control and Results'!$J$6:$L$6,0))*8760)","v":0},{"$f":"IF(F4<'Control and Results'!$D$13+1,0,INDEX('Control and Results'!$J$7:$L$7,1,MATCH(DCF!$D$1,'Control and Results'!$J$6:$L$6,0))*8760)","v":0},{"$f":"IF(G4<'Control and Results'!$D$13+1,0,INDEX('Control and Results'!$J$7:$L$7,1,MATCH(DCF!$D$1,'Control and Results'!$J$6:$L$6,0))*8760)","v":0},{"$f":"IF(H4<'Control and Results'!$D$13+1,0,INDEX('Control and Results'!$J$7:$L$7,1,MATCH(DCF!$D$1,'Control and Results'!$J$6:$L$6,0))*8760)","v":0},{"$f":"IF(I4<'Control and Results'!$D$13+1,0,INDEX('Control and Results'!$J$7:$L$7,1,MATCH(DCF!$D$1,'Control and Results'!$J$6:$L$6,0))*8760)","v":0},{"$f":"IF(J4<'Control and Results'!$D$13+1,0,INDEX('Control and Results'!$J$7:$L$7,1,MATCH(DCF!$D$1,'Control and Results'!$J$6:$L$6,0))*8760)","v":0},{"$f":"IF(K4<'Control and Results'!$D$13+1,0,INDEX('Control and Results'!$J$7:$L$7,1,MATCH(DCF!$D$1,'Control and Results'!$J$6:$L$6,0))*8760)","v":0},{"$f":"IF(L4<'Control and Results'!$D$13+1,0,INDEX('Control and Results'!$J$7:$L$7,1,MATCH(DCF!$D$1,'Control and Results'!$J$6:$L$6,0))*8760)","v":0},{"$f":"IF(M4<'Control and Results'!$D$13+1,0,INDEX('Control and Results'!$J$7:$L$7,1,MATCH(DCF!$D$1,'Control and Results'!$J$6:$L$6,0))*8760)","v":0},{"$f":"IF(N4<'Control and Results'!$D$13+1,0,INDEX('Control and Results'!$J$7:$L$7,1,MATCH(DCF!$D$1,'Control and Results'!$J$6:$L$6,0))*8760)","v":0},{"$f":"IF(O4<'Control and Results'!$D$13+1,0,INDEX('Control and Results'!$J$7:$L$7,1,MATCH(DCF!$D$1,'Control and Results'!$J$6:$L$6,0))*8760)","v":0},{"$f":"IF(P4<'Control and Results'!$D$13+1,0,INDEX('Control and Results'!$J$7:$L$7,1,MATCH(DCF!$D$1,'Control and Results'!$J$6:$L$6,0))*8760)","v":0},{"$f":"IF(Q4<'Control and Results'!$D$13+1,0,INDEX('Control and Results'!$J$7:$L$7,1,MATCH(DCF!$D$1,'Control and Results'!$J$6:$L$6,0))*8760)","v":0},{"$f":"IF(R4<'Control and Results'!$D$13+1,0,INDEX('Control and Results'!$J$7:$L$7,1,MATCH(DCF!$D$1,'Control and Results'!$J$6:$L$6,0))*8760)","v":0},{"$f":"IF(S4<'Control and Results'!$D$13+1,0,INDEX('Control and Results'!$J$7:$L$7,1,MATCH(DCF!$D$1,'Control and Results'!$J$6:$L$6,0))*8760)","v":0},{"$f":"IF(T4<'Control and Results'!$D$13+1,0,INDEX('Control and Results'!$J$7:$L$7,1,MATCH(DCF!$D$1,'Control and Results'!$J$6:$L$6,0))*8760)","v":0},{"$f":"IF(U4<'Control and Results'!$D$13+1,0,INDEX('Control and Results'!$J$7:$L$7,1,MATCH(DCF!$D$1,'Control and Results'!$J$6:$L$6,0))*8760)","v":0},{"$f":"IF(V4<'Control and Results'!$D$13+1,0,INDEX('Control and Results'!$J$7:$L$7,1,MATCH(DCF!$D$1,'Control and Results'!$J$6:$L$6,0))*8760)","v":0},{"$f":"IF(W4<'Control and Results'!$D$13+1,0,INDEX('Control and Results'!$J$7:$L$7,1,MATCH(DCF!$D$1,'Control and Results'!$J$6:$L$6,0))*8760)","v":0},{"$f":"IF(X4<'Control and Results'!$D$13+1,0,INDEX('Control and Results'!$J$7:$L$7,1,MATCH(DCF!$D$1,'Control and Results'!$J$6:$L$6,0))*8760)","v":0},{"$f":"IF(Y4<'Control and Results'!$D$13+1,0,INDEX('Control and Results'!$J$7:$L$7,1,MATCH(DCF!$D$1,'Control and Results'!$J$6:$L$6,0))*8760)","v":0},{"$f":"IF(Z4<'Control and Results'!$D$13+1,0,INDEX('Control and Results'!$J$7:$L$7,1,MATCH(DCF!$D$1,'Control and Results'!$J$6:$L$6,0))*8760)","v":0},{"$f":"IF(AA4<'Control and Results'!$D$13+1,0,INDEX('Control and Results'!$J$7:$L$7,1,MATCH(DCF!$D$1,'Control and Results'!$J$6:$L$6,0))*8760)","v":0},{"$f":"IF(AB4<'Control and Results'!$D$13+1,0,INDEX('Control and Results'!$J$7:$L$7,1,MATCH(DCF!$D$1,'Control and Results'!$J$6:$L$6,0))*8760)","v":0},{"$f":"IF(AC4<'Control and Results'!$D$13+1,0,INDEX('Control and Results'!$J$7:$L$7,1,MATCH(DCF!$D$1,'Control and Results'!$J$6:$L$6,0))*8760)","v":0},{"$f":"IF(AD4<'Control and Results'!$D$13+1,0,INDEX('Control and Results'!$J$7:$L$7,1,MATCH(DCF!$D$1,'Control and Results'!$J$6:$L$6,0))*8760)","v":0},{"$f":"IF(AE4<'Control and Results'!$D$13+1,0,INDEX('Control and Results'!$J$7:$L$7,1,MATCH(DCF!$D$1,'Control and Results'!$J$6:$L$6,0))*8760)","v":0},{"$f":"IF(AF4<'Control and Results'!$D$13+1,0,INDEX('Control and Results'!$J$7:$L$7,1,MATCH(DCF!$D$1,'Control and Results'!$J$6:$L$6,0))*8760)","v":0},{"$f":"IF(AG4<'Control and Results'!$D$13+1,0,INDEX('Control and Results'!$J$7:$L$7,1,MATCH(DCF!$D$1,'Control and Results'!$J$6:$L$6,0))*8760)","v":0},{"$f":"IF(AH4<'Control and Results'!$D$13+1,0,INDEX('Control and Results'!$J$7:$L$7,1,MATCH(DCF!$D$1,'Control and Results'!$J$6:$L$6,0))*8760)","v":0},{"$f":"IF(AI4<'Control and Results'!$D$13+1,0,INDEX('Control and Results'!$J$7:$L$7,1,MATCH(DCF!$D$1,'Control and Results'!$J$6:$L$6,0))*8760)","v":0},{"$f":"IF(AJ4<'Control and Results'!$D$13+1,0,INDEX('Control and Results'!$J$7:$L$7,1,MATCH(DCF!$D$1,'Control and Results'!$J$6:$L$6,0))*8760)","v":0},{"$f":"IF(AK4<'Control and Results'!$D$13+1,0,INDEX('Control and Results'!$J$7:$L$7,1,MATCH(DCF!$D$1,'Control and Results'!$J$6:$L$6,0))*8760)","v":0},{"$f":"IF(AL4<'Control and Results'!$D$13+1,0,INDEX('Control and Results'!$J$7:$L$7,1,MATCH(DCF!$D$1,'Control and Results'!$J$6:$L$6,0))*8760)","v":0},{"$f":"IF(AM4<'Control and Results'!$D$13+1,0,INDEX('Control and Results'!$J$7:$L$7,1,MATCH(DCF!$D$1,'Control and Results'!$J$6:$L$6,0))*8760)","v":0}]
[]
[null,null,"achieved power prices [€/MWh]",null,{"$f":"'Control and Results'!I8","v":0},{"$f":"E8+($AC$8-$E$8)/(COLUMN($AC$8)-COLUMN($E$8))","v":0},{"$f":"F8+($AC$8-$E$8)/(COLUMN($AC$8)-COLUMN($E$8))","v":0},0,0,0,0,0,0,0,0,0,0,0,0,0,0,0,0,0,0,0,0,{"$f":"AA8+($AC$8-$E$8)/(COLUMN($AC$8)-COLUMN($E$8))","v":0},{"$f":"INDEX('Control and Results'!$J$8:$L$8,1,MATCH(DCF!$D$2,'Control and Results'!$J$6:$L$6,0))","v":0},{"$f":"AC8+($AC$8-$E$8)/(COLUMN($AC$8)-COLUMN($E$8))","v":0},{"$f":"AD8+($AC$8-$E$8)/(COLUMN($AC$8)-COLUMN($E$8))","v":0},0,0,0,{"$f":"AH8+($AC$8-$E$8)/(COLUMN($AC$8)-COLUMN($E$8))","v":0},{"$f":"AI8+($AC$8-$E$8)/(COLUMN($AC$8)-COLUMN($E$8))","v":0},{"$f":"AJ8+($AC$8-$E$8)/(COLUMN($AC$8)-COLUMN($E$8))","v":0},{"$f":"AK8+($AC$8-$E$8)/(COLUMN($AC$8)-COLUMN($E$8))","v":0},{"$f":"AL8+($AC$8-$E$8)/(COLUMN($AC$8)-COLUMN($E$8))","v":0}]
[null,null,"achieved power prices [ct/kWh]",null,{"$f":"E8/10","v":0},{"$f":"F8/10","v":0},0,0,0,0,0,0,0,0,0,0,0,0,0,0,0,0,0,0,0,0,0,0,0,0,0,0,0,0,0,0,0,0,0]
[null,null,"inflation index",{"$f":"1","v":1},{"$f":"D10*(1+'Control and Results'!$K$13)","v":1},{"$f":"E10*(1+'Control and Results'!$K$13)","v":1},{"$f":"F10*(1+'Control and Results'!$K$13)","v":1},{"$f":"G10*(1+'Control and Results'!$K$13)","v":1},{"$f":"H10*(1+'Control and Results'!$K$13)","v":1},{"$f":"I10*(1+'Control and Results'!$K$13)","v":1},{"$f":"J10*(1+'Control and Results'!$K$13)","v":1},{"$f":"K10*(1+'Control and Results'!$K$13)","v":1},{"$f":"L10*(1+'Control and Results'!$K$13)","v":1},{"$f":"M10*(1+'Control and Results'!$K$13)","v":1},{"$f":"N10*(1+'Control and Results'!$K$13)","v":1},{"$f":"O10*(1+'Control and Results'!$K$13)","v":1},{"$f":"P10*(1+'Control and Results'!$K$13)","v":1},{"$f":"Q10*(1+'Control and Results'!$K$13)","v":1},{"$f":"R10*(1+'Control and Results'!$K$13)","v":1},{"$f":"S10*(1+'Control and Results'!$K$13)","v":1},{"$f":"T10*(1+'Control and Results'!$K$13)","v":1},{"$f":"U10*(1+'Control and Results'!$K$13)","v":1},{"$f":"V10*(1+'Control and Results'!$K$13)","v":1},{"$f":"W10*(1+'Control and Results'!$K$13)","v":1},{"$f":"X10*(1+'Control and Results'!$K$13)","v":1},{"$f":"Y10*(1+'Control and Results'!$K$13)","v":1},{"$f":"Z10*(1+'Control and Results'!$K$13)","v":1},{"$f":"AA10*(1+'Control and Results'!$K$13)","v":1},{"$f":"AB10*(1+'Control and Results'!$K$13)","v":1},{"$f":"AC10*(1+'Control and Results'!$K$13)","v":1},{"$f":"AD10*(1+'Control and Results'!$K$13)","v":1},{"$f":"AE10*(1+'Control and Results'!$K$13)","v":1},{"$f":"AF10*(1+'Control and Results'!$K$13)","v":1},{"$f":"AG10*(1+'Control and Results'!$K$13)","v":1},{"$f":"AH10*(1+'Control and Results'!$K$13)","v":1},{"$f":"AI10*(1+'Control and Results'!$K$13)","v":1},{"$f":"AJ10*(1+'Control and Results'!$K$13)","v":1},{"$f":"AK10*(1+'Control and Results'!$K$13)","v":1},{"$f":"AL10*(1+'Control and Results'!$K$13)","v":1}]
{"$rows_left_out":67}
{"sheet":"Placement Factors","index":4,"n_rows":250,"n_cols":14,"rows_kept":250,"cut":false,"hidden":false,"merged":[]}
[null,null,null,null,"Factors For Placement of Non-strategic Bid Price"]
[null,null,"market position","factor:","level of competition","factor:","ambition to win","factor:","secondary benefits","factor:","sunk cost","factor:",null,"combinations:"]
[null,null,"weak",0.5,"high",0.3,"high",0.2,"high",0.3,"high",0.5,null,{"$f":"2*3*3*3*2","v":108}]
[null,null,"strong",1,"medium",0.5,"medium",0.5,"medium",0.5,"low",1]
[null,null,null,null,"low",1,"low",1,"low",1]
[null,null,null,null,null,"Combination Table"]
[]
[null,null,"market position","level of competition","ambition to win","secondary benefits","sunk cost",null,"Placement Factor:"]
[null,null,"weak","high","high","high","high",null,{"$f":"IF(ROWS($I$9:I9)>$N$3,\"\",INDEX($D$3:$D$5,MATCH(C9,$C$3:$C$5,0),1)*INDEX($F$3:$F$5,MATCH(D9,Rcompetition,0),1)*INDEX($H$3:$H$5,MATCH(E9,Rambition,0),1)*INDEX($J$3:$J$5,MATCH(F9,$I$3:$I$5,0),1)*INDEX($L$3:$L$5,MATCH(G9,$K$3:$K$5,0),1))","v":4.4999999999999997E-3}]
[null,null,"weak","high","high","high","low",null,{"$f":"IF(ROWS($I$9:I10)>$N$3,\"\",INDEX($D$3:$D$5,MATCH(C10,$C$3:$C$5,0),1)*INDEX($F$3:$F$5,MATCH(D10,Rcompetition,0),1)*INDEX($H$3:$H$5,MATCH(E10,Rambition,0),1)*INDEX($J$3:$J$5,MATCH(F10,$I$3:$I$5,0),1)*INDEX($L$3:$L$5,MATCH(G10,$K$3:$K$5,0),1))","v":8.9999999999999993E-3}]
{"$rows_left_out":241}
{"sheet":"Default Values","index":5,"n_rows":72,"n_cols":21,"rows_kept":72,"cut":false,"hidden":false,"merged":[[66,3,66,5],[66,6,66,8],[66,9,66,11],[66,15,66,17],[66,18,66,20],[66,12,66,14]]}
[]
[null,null,null,null,"Default Values"]
[]
[null,null,null,"Country Specific Values"]
[null,null,"Country","WACC (%)","Corporate Tax Rate (%)","Inflation (%)","El Market Price  [€/MWh]"]
[]
[null,null,"AT",6.5000000000000002E-2,0.25,2.8999999999999998E-2,35]
[null,null,"BE",5.5E-2,0.33990000000000004,2.7000000000000003E-2,35]
[null,null,"BG",0.1,0.1,4.2000000000000003E-2,30]
[null,null,"HR",0.12,0.2,1.7000000000000001E-2,50]
{"$rows_left_out":62}